{"text_format":"1","workbook":"xlsx","n_sheets":16,"sheets":["Controls","Series","Initial","Boundary","Utility","Rates","Nexus","Value","PSIU","Finance","Price","Zeta","Demand","Transactions","Investment","State"],"not_rendered":{"charts":4,"images":6,"macros":1,"external_links":0,"defined_names":20,"comments":0,"pivot_tables":0},"unopened":[],"bounds":{"document_bytes":16777216,"sheet_cells":100000,"rows_first":2000,"rows_last":500,"rows_between":2000,"halvings":0,"cell_chars":16384,"cell_head_chars":4096},"cells_cut":0,"cells_raw":0,"read":"whole","date_system":"1900"}

{"sheet":"Controls","index":0,"n_rows":20,"n_cols":2,"rows_kept":20,"cut":false,"hidden":false,"merged":[]}
[]
[]
[]
[]
[]
[]
[]
[]
[]
[]
{"$rows_left_out":11}
{"sheet":"Series","index":1,"n_rows":77,"n_cols":27,"rows_kept":77,"cut":false,"hidden":false,"merged":[]}
[]
[]
[]
[null,"BUFFER ->"]
[null,null,{"$f":"TicToc","v":30.000591278076172},{"$f":"Nexus!X15","v":749.41727214321145},{"$f":"Value!K42","v":749.44359064648438},{"$f":"Demand!K55","v":749.38676047479873},{"$f":"Price!K58","v":191.984323292726},{"$f":"Price!K35","v":191.98534650635483},{"$f":"Price!K36","v":191.98344243844369},{"$f":"Price!K41","v":191.98856059649881},{"$f":"X64","v":175.53892814788458},{"$f":"-Nu","v":4.5351397557338351E-2},{"$f":"Value!G48","v":0.45983533088235939}]
[]
[null,"BOX:",null,"Y2","S2","D2","P2","MC2","VMP1","VMPL","P*","-n","G/$"]
[null,0,0,750.00000000001364,750.00000000001364,738.70131350385486,188.75297089837716,190.53506569016113,190.53506569020391,190.55619832866344,175.53892814788458,4.5359983017170896E-2,0.46560965645531072]
[null,1,1.0099993944168091,749.55700132123911,749.95432873737775,749.42655282541705,189.38159287910221,189.30806462094327,189.28095778883522,185.32857768806667,175.53892814788458,4.5336417428182868E-2,0.46549857753483748]
[null,2,2.0199985504150391,749.28519597249579,749.52352600147526,750.310138500226,189.32214858779432,189.3356271469639,189.22734216721318,188.3051093345054,175.53892814788458,4.534844799399243E-2,0.46613922046068373]
{"$rows_left_out":68}
{"sheet":"Initial","index":2,"n_rows":122,"n_cols":56,"rows_kept":122,"cut":false,"hidden":false,"merged":[[5,12,5,15],[5,8,5,11]]}
[]
[]
[]
[null,null,"Boundary"]
[null,null,"Conditions >"]
[null,null,null,null,null,null,null,null,"INDUSTRIES",null,null,null,"HOUSEHOLDS"]
[]
[null,null,null,null,null,null,null,null,"VALUE","CAPITAL","GENERAL","NON_DUR",null,"BOURGS","PRLTRT","DPNDNT"]
[null,null,null,null,null,null,null,null,"0",{"$f":"1+I9","v":1},{"$f":"1+J9","v":2},{"$f":"1+K9","v":3},null,{"$f":"1+L9","v":4},{"$f":"1+N9","v":5},{"$f":"1+O9","v":6}]
[null,null,null,null,null,null,null,null,"0","I1","I2","I3",null,"L1","L2","L3"]
{"$rows_left_out":113}
{"sheet":"Boundary","index":3,"n_rows":122,"n_cols":54,"rows_kept":122,"cut":false,"hidden":false,"merged":[[5,12,5,15],[5,8,5,11]]}
[]
[]
[]
[null,null,"Boundary"]
[null,null,"Conditions >"]
[null,null,null,null,null,null,null,null,"INDUSTRIES",null,null,null,"HOUSEHOLDS"]
[]
[null,null,null,null,null,null,null,null,"VALUE","CAPITAL","GENERAL","NON_DUR",null,"BOURGS","PRLTRT","DPNDNT"]
[null,null,null,null,null,null,null,null,"0",{"$f":"1+I9","v":1},{"$f":"1+J9","v":2},{"$f":"1+K9","v":3},null,{"$f":"1+L9","v":4},{"$f":"1+N9","v":5},{"$f":"1+O9","v":6}]
[null,null,null,null,null,null,null,null,"0","I1","I2","I3",null,"L1","L2","L3"]
{"$rows_left_out":113}
{"sheet":"Utility","index":4,"n_rows":60,"n_cols":27,"rows_kept":60,"cut":false,"hidden":false,"merged":[[5,9,5,11],[5,13,5,15],[59,9,59,11],[59,13,59,15]]}
[]
[]
[]
[]
[]
[null,null,null,null,null,null,null,null,null,"INDUSTRIES",null,null,null,"HOUSEHOLDS"]
[]
[null,null,"Utility",null,null,null,null,null,"VALUE","CAPITAL","GENERAL","NON_DUR",null,"BOURGS","PRLTRT","DPNDNT"]
[null,null,"Tradeoffs >",null,null,null,"U >",null,"0",1,2,3,null,4,5,6]
[null,null,null,null,null,null,null,null,"0","I1","I2","I3",null,"L1","L2","L3"]
{"$rows_left_out":51}
{"sheet":"Rates","index":5,"n_rows":66,"n_cols":19,"rows_kept":66,"cut":false,"hidden":false,"merged":[[2,8,2,10],[2,12,2,14],[65,8,65,10],[65,12,65,14]]}
[]
[]
[null,null,null,null,null,null,null,null,"INDUSTRIES",null,null,null,"HOUSEHOLDS"]
[]
[null,null,null,"Markets >",null,null,null,{"$f":"-SUM(H11:H27)","v":-1.9213075574953109E-11},{"$f":"-SUM(I11:I27)","v":2.3591464231252246E-2},{"$f":"-SUM(J11:J27)","v":7.8955509818630532E-2},{"$f":"-SUM(K11:K27)","v":0.1364767894115495},null,{"$f":"-SUM(M11:M27)","v":-1.6088172460904104E-13},{"$f":"-SUM(N11:N27)","v":2.1138646388862981E-13},{"$f":"-SUM(O11:O27)","v":0}]
[null,null,null,null,null,null,null,"0","I1","I2","I3",null,"L1","L2","L3"]
[null,null,null,null,null,null,null,"0",1,2,3,null,4,5,6]
[null,null,"Physical State",null,null,null,null,"VALUE","CAPITAL","GENERAL","NON_DUR",null,"BOURGS","PRLTRT","DPNDNT"]
[null,null,"Variables >",null,null,null,null,"0",1,2,3,null,4,5,6]
[null,null,null,null,null,null,null,"0","I1","I2","I3",null,"L1","L2","L3"]
{"$rows_left_out":57}
{"sheet":"Nexus","index":6,"n_rows":71,"n_cols":28,"rows_kept":71,"cut":false,"hidden":false,"merged":[[5,9,5,11],[5,13,5,15],[53,9,53,11],[53,13,53,15]]}
[]
[]
[]
[]
[]
[null,null,null,null,null,null,null,null,null,"INDUSTRIES",null,null,null,"HOUSEHOLDS"]
[]
[null,null,"U + E ",null,"m >",null,null,null,"VALUE","CAPITAL","GENERAL","NON_DUR",null,"BOURGS","PRLTRT","DPNDNT"]
[null,null,null,null,null,null,null,null,"0",1,2,3,null,4,5,6]
[null,null,null,null,null,null,null,null,"0","I1","I2","I3",null,"L1","L2","L3"]
{"$rows_left_out":62}
{"sheet":"Value","index":7,"n_rows":62,"n_cols":20,"rows_kept":62,"cut":false,"hidden":false,"merged":[[5,9,5,11],[5,13,5,15]]}
[]
[]
[]
[]
[]
[null,null,null,null,null,null,null,null,null,"INDUSTRIES",null,null,null,"HOUSEHOLDS"]
[]
[null,null,null,null,null,null,"HQ >",null,"VALUE","CAPITAL","GENERAL","NON_DUR",null,"BOURGS","PRLTRT","DPNDNT"]
[null,null,null,null,null,null,null,null,"0",1,2,3,null,4,5,6]
[null,null,null,null,null,null,null,null,"0","I1","I2","I3",null,"L1","L2","L3"]
{"$rows_left_out":53}
{"sheet":"PSIU","index":8,"n_rows":51,"n_cols":18,"rows_kept":51,"cut":false,"hidden":false,"merged":[]}
[]
[]
[]
[]
[]
[]
[]
[null,null,null,null,null,null,null,null,"VALUE","CAPITAL","GENERAL","NON_DUR",null,"BOURGS","PRLTRT","DPNDNT"]
[null,null,null,null,"YU >",null,null,null,"0",1,2,3,null,4,5,6]
[null,null,null,null,null,null,null,null,"0","I1","I2","I3",null,"L1","L2","L3"]
{"$rows_left_out":42}
{"sheet":"Finance","index":9,"n_rows":89,"n_cols":39,"rows_kept":89,"cut":false,"hidden":false,"merged":[[88,9,88,10],[88,15,88,16],[4,33,4,34],[24,33,24,34],[4,9,4,10],[4,15,4,16]]}
[]
[]
[]
[]
[null,null,null,null,null,null,null,null,null,"GOVERNMENT",null,null,"COMMERCIAL BANKING",null,null,"RETAIL BANKING",null,null,"GOVERNMENT BANKING",null,null,null,null,null,null,null,null,null,null,"COMMERCIAL BANKING",null,null,null,"RETAIL BANKING",null,null,null,"GOVERNMENT BANKING"]
[]
[]
[null,null,null,null,null,null,null,null,null,"LOCAL","NATIONAL",null,"SAVINGS","INVESTMENT",null,"SAVINGS","INVESTMENT",null,"SAVINGS","INVESTMENT",null,null,null,null,null,null,null,null,null,"SAVINGS","INVESTMENT",null,null,"SAVINGS","INVESTMENT",null,null,"SAVINGS","INVESTMENT"]
[null,null,null,null,null,null,null,null,null,7,8,null,9,9,null,10,10,null,11,11,null,null,null,null,null,null,null,null,null,9,9,null,null,10,10,null,null,11,11]
[null,null,null,null,null,null,null,null,null,"G1","G2",null,"FI","FI",null,"FL","FL",null,"FG","FG",null,null,null,null,null,null,null,null,null,"FI","FI",null,null,"FL","FL",null,null,"FG","FG"]
{"$rows_left_out":80}
{"sheet":"Price","index":10,"n_rows":63,"n_cols":20,"rows_kept":63,"cut":false,"hidden":false,"merged":[[5,9,5,11],[5,13,5,15]]}
[]
[]
[]
[]
[]
[null,null,null,null,null,null,null,null,null,"INDUSTRIES",null,null,null,"HOUSEHOLDS"]
[]
[null,null,null,null,null,null,null,null,"VALUE","CAPITAL","GENERAL","NON_DUR",null,"BOURGS","PRLTRT","DPNDNT"]
[null,null,null,null,null,null,null,null,"0",1,2,3,null,4,5,6]
[null,null,"beta >",null,null,null,"Hb >",null,"0","I1","I2","I3",null,"L1","L2","L3"]
{"$rows_left_out":54}
{"sheet":"Zeta","index":11,"n_rows":71,"n_cols":32,"rows_kept":71,"cut":false,"hidden":false,"merged":[[4,9,4,11],[4,13,4,15]]}
[]
[]
[]
[]
[null,null,null,null,null,null,null,null,null,"INDUSTRIES",null,null,null,"HOUSEHOLDS"]
[]
[]
[null,null,null,null,null,null,null,null,"VALUE","CAPITAL","GENERAL","NON_DUR",null,"BOURGS","PRLTRT","DPNDNT"]
[null,null,null,null,"PU >",null,null,null,"0",1,2,3,null,4,5,6]
[null,null,null,null,null,null,null,null,"0","I1","I2","I3",null,"L1","L2","L3"]
{"$rows_left_out":62}
{"sheet":"Demand","index":12,"n_rows":60,"n_cols":20,"rows_kept":60,"cut":false,"hidden":false,"merged":[[59,9,59,11],[59,13,59,15],[5,9,5,11],[5,13,5,15]]}
[]
[]
[]
[]
[]
[null,null,null,null,null,null,null,null,null,"INDUSTRIES",null,null,null,"HOUSEHOLDS"]
[]
[null,null,null,null,null,null,null,null,"VALUE","CAPITAL","GENERAL","NON_DUR",null,"BOURGS","PRLTRT","DPNDNT"]
[null,null,null,null,null,null,null,null,"0",1,2,3,null,4,5,6]
[null,null,null,null,"zeta >",null,"Hz >",null,"0","I1","I2","I3",null,"L1","L2","L3"]
{"$rows_left_out":51}
{"sheet":"Transactions","index":13,"n_rows":52,"n_cols":33,"rows_kept":52,"cut":false,"hidden":false,"merged":[[2,9,2,11],[2,13,2,15]]}
[]
[]
[null,null,null,null,null,null,null,null,null,"INDUSTRIES",null,null,null,"HOUSEHOLDS"]
[null,null,null,"Demand"]
[null,null,null,"Factors","Fd >",null,null,null,{"$f":"Value!I42/Demand!I55","v":0.99999959809528449},{"$f":"IF(Value!J42<Demand!J55,Value!J42/Demand!J55,1)","v":1},{"$f":"IF(Value!K42<Demand!K55,Value!K42/Demand!K55,1)","v":1},{"$f":"IF(Value!L42<Demand!L55,Value!L42/Demand!L55,1)","v":1},null,{"$f":"IF(Value!N42<Demand!N55,Value!N42/Demand!N55,1)","v":1},{"$f":"IF(Value!O42<Demand!O55,Value!O42/Demand!O55,1)","v":1},{"$f":"IF(Value!P42<Demand!P55,Value!P42/Demand!P55,1)","v":1},null,null,null,null,null,null,null,"Taxes >"]
[null,null,null,null,null,null,null,null,"0","I1","I2","I3",null,"L1","L2","L3"]
[null,null,null,null,null,null,null,null,"0",1,2,3,null,4,5,6]
[null,null,null,"Asset",null,null,null,null,"VALUE","CAPITAL","GENERAL","NON_DUR",null,"BOURGS","PRLTRT","DPNDNT",null,null,null,null,null,null,null,null,"LOCAL","NATIONAL"]
[null,null,null,null,"Replenishment >",null,"R >",null,"0",1,2,3,null,4,5,6,null,null,null,null,null,null,null,null,7,8]
[null,null,null,null,null,null,null,null,"0","I1","I2","I3",null,"L1","L2","L3",null,null,null,null,null,null,null,null,"G1","G2"]
{"$rows_left_out":43}
{"sheet":"Investment","index":14,"n_rows":58,"n_cols":35,"rows_kept":58,"cut":false,"hidden":false,"merged":[]}
[]
[]
[]
[]
[null,null,null,null,null,null,null,null,null,null,null,null,null,null,null,null,null,null,null,null,null,"Debt"]
[null,null,null,null,null,"All Financial Intermediation >",null,null,null,null,null,null,null,null,null,null,null,null,null,null,null,"Service >   "]
[]
[null,null,null,null,null,null,null,null,null,"Passive ","Interest"]
[null,null,null,null,null,null,null,null,null,"Income (-)",null,null,null,null,null,null,null,null,"n ",{"$f":"Nu","v":-4.5351397557338351E-2},"i ",{"$f":"Price!G36","v":0.99999531777097239},{"$f":"Price!G37","v":1.0000053905851407},{"$f":"Price!G38","v":1.0000059123631286},null,null,null,null,9,10,11]
[null,null,null,null,null,null,null,null,null,{"$f":"Finance!M67+Finance!P67+Finance!S67","v":0},{"$f":"Finance!N67+Finance!Q67+Finance!T67","v":0},null,null,null,null,null,"     ,",null,null,null,null,null,null,null,null,null,null,null,"FI","FL","FG"]
{"$rows_left_out":49}
{"sheet":"State","index":15,"n_rows":94,"n_cols":31,"rows_kept":94,"cut":false,"hidden":false,"merged":[]}
[]
[]
[]
[]
[]
[]
[]
[null,null,null,null,null,null,null,null,"VALUE","CAPITAL","GENERAL","NON_DUR",null,"BOURGS","PRLTRT","DPNDNT",null,"LOCAL","NATIONAL",null,"COMMERCIAL","RETAIL","GOVT"]
[null,null,null,null,null,null,null,null,"0",1,2,3,null,4,5,6,null,7,8,null,9,10,11]
[null,null,null,null,null,null,null,null,"0","I1","I2","I3",null,"L1","L2","L3",null,"G1","G2",null,"FI","FL","FG"]
{"$rows_left_out":84}